Reaction Details
TargetE-selectin
LigandBDBM50051835
Substrate/Competitorn/a
Meas. Tech.ChEMBL_60881 (CHEMBL673528)
IC50 1000000±n/a nM
Citation Ramphal, JYHiroshige, MLou, BGaudino, JJHayashi, MChen, SMChiang, LCGaeta, FCDeFrees, SA Ligand interactions with E-selectin. Identification of a new binding site for recognition of N-acyl aromatic glucosamine substituents of sialyl Lewis X. J Med Chem39:1357-60 (1996) 
 
E-selectin
Name:E-selectin
Type:PROTEIN
Mol. Mass.:66642.96
Organism:Homo sapiens (Human)
Description:ChEMBL_1438995
Residue:610
BDBM50051835
NameBDBM50051835
Synonyms:CHEMBL2368520 | Ethyl(Sodium 5-actamido-3,5-dideoxy-alpha-D-glycero-D-galacto-nonulopyronosylonate)-(2,3)-O-(beta-D-galactopyranosyl)-(1,4)-O(alpha-L-fucopyranosyl)-(1,3)-O-[2-(N-acetylamido)-2-deoxy-beta-D-glucopyranosyl]-(1,3)-O-beta-D-galactopyranoside(N-acetyl SLex)
TypeSmall organic molecule
Emp. Form.C39H65N2NaO28
Mol. Mass.1032.9198
SMILES[Na+].[H][C@]1(O[C@@](C[C@@H](O)[C@H]1NC(C)=O)(O[C@H]1[C@@H](O)[C@H](CO)O[C@@H](O[C@@H]2[C@H](CO)O[C@@H](O[C@H]3[C@@H](O)[C@H](CO)O[C@@H](OCC)[C@H]3O)[C@@H](NC(C)=O)[C@H]2O[C@@H]2O[C@@H](C)[C@@H](O)[C@H](O)[C@@H]2O)[C@H]1O)C([O-])=O)[C@H](O)[C@H](O)CO