Reaction Details
TargetSterol O-acyltransferase 1
LigandBDBM50051891
Substrate/Competitorn/a
Meas. Tech.ChEMBL_28661 (CHEMBL643995)
IC50 70±n/a nM
Citation Astles, PCAshton, MJBridge, AWHarris, NVHart, TWParrott, DPPorter, BRiddell, DSmith, CWilliams, RJ Acyl-CoA:Cholesterol O-acyltransferase (ACAT) inhibitors. 2. 2-(1,3-Dioxan-2-yl)-4,5-diphenyl-1H-imidazoles as potent inhibitors of ACAT. J Med Chem39:1423-32 (1996) 
 
Sterol O-acyltransferase 1
Name:Sterol O-acyltransferase 1
Type:Multi-pass membrane protein may form homo- or heterodimers.
Mol. Mass.:64751.94
Organism:Homo sapiens (Human)
Description:P35610
Residue:550
BDBM50051891
NameBDBM50051891
Synonyms:1-{4-[2-(4,5-Diphenyl-1H-imidazol-2-yl)-5-methyl-[1,3]dioxan-5-yl]-butyl}-4-phenyl-piperazine | CHEMBL33229
TypeSmall organic molecule
Emp. Form.C34H40N4O2
Mol. Mass.536.707
SMILESCC1(CCCCN2CCN(CC2)c2ccccc2)COC(OC1)c1nc(c([nH]1)-c1ccccc1)-c1ccccc1