Reaction Details
TargetSterol O-acyltransferase 1
LigandBDBM50051897
Substrate/Competitorn/a
Meas. Tech.ChEMBL_28796 (CHEMBL641706)
IC50 15±n/a nM
Citation Astles, PCAshton, MJBridge, AWHarris, NVHart, TWParrott, DPPorter, BRiddell, DSmith, CWilliams, RJ Acyl-CoA:Cholesterol O-acyltransferase (ACAT) inhibitors. 2. 2-(1,3-Dioxan-2-yl)-4,5-diphenyl-1H-imidazoles as potent inhibitors of ACAT. J Med Chem39:1423-32 (1996) 
 
Sterol O-acyltransferase 1
Name:Sterol O-acyltransferase 1
Type:PROTEIN
Mol. Mass.:64165.56
Organism:Rattus norvegicus
Description:ChEMBL_28796
Residue:545
BDBM50051897
NameBDBM50051897
Synonyms:2-(5,5-Diethyl-[1,3]dioxan-2-yl)-4,5-diphenyl-1H-imidazole | CHEMBL33842
TypeSmall organic molecule
Emp. Form.C23H26N2O2
Mol. Mass.362.4647
SMILESCCC1(CC)COC(OC1)c1nc(c([nH]1)-c1ccccc1)-c1ccccc1