Reaction Details
TargetRetinoic acid receptor gamma
LigandBDBM31892
Substrate/Competitorn/a
Meas. Tech.ChEMBL_196176 (CHEMBL804949)
EC50 74±n/a nM
Citation Zhang, LNadzan, AMHeyman, RALove, DLMais, DECroston, GLamph, WWBoehm, MF Discovery of novel retinoic acid receptor agonists having potent antiproliferative activity in cervical cancer cells. J Med Chem39:2659-63 (1996) 
 
Retinoic acid receptor gamma
Name:Retinoic acid receptor gamma
Type:PROTEIN
Mol. Mass.:50345.43
Organism:Homo sapiens (Human)
Description:ChEMBL_1458016
Residue:454
BDBM31892
NameBDBM31892
Synonyms:9-cis retinoic acid CHEMBL705 alitretinoin
TypeSmall organic molecule
Emp. Form.C20H28O2
Mol. Mass.300.4351
SMILESC\C(\C=C\C1=C(C)CCCC1(C)C)=C\C=C\C(\C)=C\C(O)=O