Reaction Details
TargetRetinoic acid receptor RXR-alpha
LigandBDBM31883
Substrate/Competitorn/a
Meas. Tech.ChEMBL_196903 (CHEMBL807187)
EC50 1084±n/a nM
Citation Zhang, LNadzan, AMHeyman, RALove, DLMais, DECroston, GLamph, WWBoehm, MF Discovery of novel retinoic acid receptor agonists having potent antiproliferative activity in cervical cancer cells. J Med Chem39:2659-63 (1996) 
 
Retinoic acid receptor RXR-alpha
Name:Retinoic acid receptor RXR-alpha
Type:PROTEIN
Mol. Mass.:50820.38
Organism:Homo sapiens (Human)
Description:ChEMBL_1456363
Residue:462
BDBM31883
NameBDBM31883
Synonyms:9-cis-retinoic acid (9cRA) AT-RA CHEMBL38 SMR000058245 Vitamin A acid [3H]Retinoic acid [3H]tretinoin cid_444795
Typeradiolabeled ligand
Emp. Form.C20H28O2
Mol. Mass.300.4351
SMILESC\C(\C=C\C1=C(C)CCCC1(C)C)=C/C=C/C(/C)=C/C(O)=O