Reaction Details
TargetRetinoic acid receptor beta
LigandBDBM50052033
Substrate/Competitorn/a
Meas. Tech.ChEMBL_195821 (CHEMBL800285)
Ki 90.0±n/a nM
Citation Zhang, LNadzan, AMHeyman, RALove, DLMais, DECroston, GLamph, WWBoehm, MF Discovery of novel retinoic acid receptor agonists having potent antiproliferative activity in cervical cancer cells. J Med Chem39:2659-63 (1996) 
 
Retinoic acid receptor beta
Name:Retinoic acid receptor beta
Type:PROTEIN
Mol. Mass.:50498.70
Organism:Homo sapiens (Human)
Description:ChEMBL_1458015
Residue:455
BDBM50052033
NameBDBM50052033
Synonyms:(2E,4E,6E)-7-(3,5-Di-tert-butyl-phenyl)-3-methyl-octa-2,4,6-trienoic acid CHEMBL89241
TypeSmall organic molecule
Emp. Form.C23H32O2
Mol. Mass.340.499
SMILESC\C(\C=C\C=C(/C)c1cc(cc(c1)C(C)(C)C)C(C)(C)C)=C/C(O)=O