Reaction Details
TargetRetinoic acid receptor RXR-gamma
LigandBDBM31892
Substrate/Competitorn/a
Meas. Tech.ChEMBL_197241 (CHEMBL803363)
Ki 13±n/a nM
Citation Zhang, LNadzan, AMHeyman, RALove, DLMais, DECroston, GLamph, WWBoehm, MF Discovery of novel retinoic acid receptor agonists having potent antiproliferative activity in cervical cancer cells. J Med Chem39:2659-63 (1996) 
 
Retinoic acid receptor RXR-gamma
Name:Retinoic acid receptor RXR-gamma
Type:PROTEIN
Mol. Mass.:50878.26
Organism:Homo sapiens (Human)
Description:ChEMBL_197216
Residue:463
BDBM31892
NameBDBM31892
Synonyms:9-cis retinoic acid CHEMBL705 alitretinoin
TypeSmall organic molecule
Emp. Form.C20H28O2
Mol. Mass.300.4351
SMILESC\C(\C=C\C1=C(C)CCCC1(C)C)=C\C=C\C(\C)=C\C(O)=O