Reaction Details
TargetReverse transcriptase/RNaseH
LigandBDBM50052052
Substrate/Competitorn/a
Meas. Tech.ChEMBL_195066 (CHEMBL797521)
IC50 10000±n/a nM
Citation Campiani, GNacci, VFiorini, IDe Filippis, MPGarofalo, AGreco, GNovellino, EAltamura, SDi Renzo, L Pyrrolobenzothiazepinones and pyrrolobenzoxazepinones: novel and specific non-nucleoside HIV-1 reverse transcriptase inhibitors with antiviral activity. J Med Chem39:2672-80 (1996) 
 
Reverse transcriptase/RNaseH
Name:Reverse transcriptase/RNaseH
Type:PROTEIN
Mol. Mass.:65229.15
Organism:Human immunodeficiency virus 1
Description:ChEMBL_1473730
Residue:566
BDBM50052052
NameBDBM50052052
Synonyms:5-Methyl-5-phenyl-6-oxa-10b-aza-benzo[e]azulen-4-one | CHEMBL91318
TypeSmall organic molecule
Emp. Form.C19H15NO2
Mol. Mass.289.3279
SMILESCC1(Oc2ccccc2-n2cccc2C1=O)c1ccccc1