Reaction Details
TargetD(4) dopamine receptor
LigandBDBM50052195
Substrate/Competitorn/a
Meas. Tech.ChEMBL_60660 (CHEMBL671697)
Ki 1.5±n/a nM
Citation Ohmori, JMaeno, KHidaka, KNakato, KMatsumoto, MTada, SHattori, HSakamoto, STsukamoto, SUsuda, SMase, T Dopamine D3 and D4 receptor antagonists: synthesis and structure--activity relationships of (S)-(+)-N-(1-Benzyl-3-pyrrolidinyl)-5-chloro-4- [(cyclopropylcarbonyl) amino]-2-methoxybenzamide (YM-43611) and related compounds. J Med Chem39:2764-72 (1996) 
 
D(4) dopamine receptor
Name:D(4) dopamine receptor
Type:Enzyme
Mol. Mass.:48373.19
Organism:Homo sapiens (Human)
Description:P21917
Residue:419
BDBM50052195
NameBDBM50052195
Synonyms:CHEMBL93198 | N-((S)-1-Benzyl-pyrrolidin-3-yl)-5-chloro-2-methoxy-4-propionylamino-benzamide
TypeSmall organic molecule
Emp. Form.C22H26ClN3O3
Mol. Mass.415.913
SMILESCCC(=O)Nc1cc(OC)c(cc1Cl)C(=O)N[C@H]1CCN(Cc2ccccc2)C1