Reaction Details
Target5-lipoxygenase
LigandBDBM50052460
Substrate/Competitorn/a
Meas. Tech.ChEMBL_3988 (CHEMBL619260)
IC50 8000±n/a nM
Citation Müller, KHuang, HSWiegrebe, W Antipsoriatic anthrones with modulated redox properties. 3. 10-thio-substituted 1,8-dihydroxy-9(10H)-anthracenones as inhibitors of keratinocyte growth, 5-lipoxygenase, and the formation of 12(S)-HETE in mouse epidermis. J Med Chem39:3132-8 (1996) 
 
5-lipoxygenase
Name:5-lipoxygenase
Synonyms:Arachidonate 5-lipoxygenase
Type:PROTEIN
Mol. Mass.:49994.23
Organism:Bos taurus
Description:ChEMBL_157766
Residue:430
BDBM50052460
NameBDBM50052460
TypeSmall organic molecule
Emp. Form.C20H14O3S
Mol. Mass.334.388
SMILESOc1cccc2C(Sc3ccccc3)c3cccc(O)c3C(=O)c12