Reaction Details
Target5-lipoxygenase
LigandBDBM50052470
Substrate/Competitorn/a
Meas. Tech.ChEMBL_3988 (CHEMBL619260)
IC50 3000±n/a nM
Citation Müller, KHuang, HSWiegrebe, W Antipsoriatic anthrones with modulated redox properties. 3. 10-thio-substituted 1,8-dihydroxy-9(10H)-anthracenones as inhibitors of keratinocyte growth, 5-lipoxygenase, and the formation of 12(S)-HETE in mouse epidermis. J Med Chem39:3132-8 (1996) 
 
5-lipoxygenase
Name:5-lipoxygenase
Synonyms:Arachidonate 5-lipoxygenase
Type:PROTEIN
Mol. Mass.:49994.23
Organism:Bos taurus
Description:ChEMBL_157766
Residue:430
BDBM50052470
NameBDBM50052470
TypeSmall organic molecule
Emp. Form.C21H16O4S
Mol. Mass.364.414
SMILESCOc1ccc(SC2c3cccc(O)c3C(=O)c3c(O)cccc23)cc1