Reaction Details
TargetB2 bradykinin receptor
LigandBDBM50052510
Substrate/Competitorn/a
Meas. Tech.ChEMBL_40421 (CHEMBL652636)
Ki 27±n/a nM
Citation Mavunkel, BJLu, ZGoehring, RRLu, SChakravarty, SPerumattam, JNovotny, EAConnolly, MValentine, HKyle, DJ Synthesis and characterization of pseudopeptide bradykinin B2 receptor antagonists containing the 1,3,8-triazaspiro[4.5]decan-4-one ring system. J Med Chem39:3169-73 (1996) 
 
B2 bradykinin receptor
Name:B2 bradykinin receptor
Type:Enzyme Catalytic Domain
Mol. Mass.:44467.17
Organism:Homo sapiens (Human)
Description:B2 BRADYKININ BDKRB2 HUMAN::P30411
Residue:391
BDBM50052510
NameBDBM50052510
Synonyms:8-Methyl-3-(2-oxo-propyl)-1-propyl-1,3,8-triaza-spiro[4.5]decan-4-one | CHEMBL107234
TypeSmall organic molecule
Emp. Form.C14H25N3O2
Mol. Mass.267.3672
SMILESCCCN1CN(CC(C)=O)C(=O)C11CCN(C)CC1