Reaction Details
TargetSubstance-P receptor
LigandBDBM50052520
Substrate/Competitorn/a
Meas. Tech.ChEMBL_205397 (CHEMBL817414)
EC50 160±n/a nM
Citation Byk, GHalle, DZeltser, IBitan, GSelinger, ZGilon, C Synthesis and biological activity of NK-1 selective, N-backbone cyclic analogs of the C-terminal hexapeptide of substance P. J Med Chem39:3174-8 (1996) 
 
Substance-P receptor
Name:Substance-P receptor
Type:Enzyme Catalytic Domain
Mol. Mass.:46261.42
Organism:GUINEA PIG
Description:Neurokinin NK1 TACR1 GUINEA PIG::P30547
Residue:407
BDBM50052520
NameBDBM50052520
Synonyms:(S)-2-{2-[(3S,6R,9S)-3,6-Dibenzyl-9-(3-guanidino-propyl)-2,5,8,11,14-pentaoxo-1,4,7,10,15pentaaza-cyclohenicos-1-yl]-acetylamino}-4-methyl-pentanoic acid ((S)-1-carbamoyl-3-methylsulfanyl-propyl)-amide | CHEMBL323028
TypeSmall organic molecule
Emp. Form.C47H71N11O8S
Mol. Mass.950.201
SMILESCSCC[C@H](NC(=O)[C@H](CC(C)C)NC(=O)CN1CCCCCCNC(=O)CCC(=O)N[C@@H](CCCNC(N)=N)C(=O)N[C@H](Cc2ccccc2)C(=O)N[C@@H](Cc2ccccc2)C1=O)C(N)=O