Reaction Details
TargetD(2) dopamine receptor
LigandBDBM50052532
Substrate/Competitorn/a
Meas. Tech.ChEMBL_62401 (CHEMBL675726)
Ki 1.9±n/a nM
Citation Glase, SAAkunne, HCHeffner, TGJaen, JCMacKenzie, RGMeltzer, LTPugsley, TASmith, SJWise, LD Aryl 1-but-3-ynyl-4-phenyl-1,2,3,6-tetrahydropyridines as potential antipsychotic agents: synthesis and structure-activity relationships. J Med Chem39:3179-87 (1996) 
 
D(2) dopamine receptor
Name:D(2) dopamine receptor
Type:G Protein-Coupled Receptor (GPCR)
Mol. Mass.:50931.60
Organism:Rattus norvegicus (rat)
Description:P61169
Residue:444
BDBM50052532
NameBDBM50052532
Synonyms:6-[4-(4-Phenyl-3,6-dihydro-2H-pyridin-1-yl)-but-1-ynyl]-pyridin-3-ylamine | CHEMBL109101
TypeSmall organic molecule
Emp. Form.C20H21N3
Mol. Mass.303.4008
SMILESNc1ccc(nc1)C#CCCN1CCC(=CC1)c1ccccc1