Reaction Details
TargetD(2) dopamine receptor
LigandBDBM50052528
Substrate/Competitorn/a
Meas. Tech.ChEMBL_62223 (CHEMBL670697)
Ki 3.3±n/a nM
Citation Glase, SAAkunne, HCHeffner, TGJaen, JCMacKenzie, RGMeltzer, LTPugsley, TASmith, SJWise, LD Aryl 1-but-3-ynyl-4-phenyl-1,2,3,6-tetrahydropyridines as potential antipsychotic agents: synthesis and structure-activity relationships. J Med Chem39:3179-87 (1996) 
 
D(2) dopamine receptor
Name:D(2) dopamine receptor
Type:G Protein-Coupled Receptor (GPCR)
Mol. Mass.:50931.60
Organism:Rattus norvegicus (rat)
Description:P61169
Residue:444
BDBM50052528
NameBDBM50052528
Synonyms:3-[4-(4-Phenyl-3,6-dihydro-2H-pyridin-1-yl)-but-1-ynyl]-pyridine | CHEMBL108463
TypeSmall organic molecule
Emp. Form.C20H20N2
Mol. Mass.288.3862
SMILESC(CN1CCC(=CC1)c1ccccc1)C#Cc1cccnc1