Reaction Details
TargetD(4) dopamine receptor
LigandBDBM50002173
Substrate/Competitorn/a
Meas. Tech.ChEMBL_60663 (CHEMBL872782)
Ki 24±n/a nM
Citation Glase, SAAkunne, HCHeffner, TGJaen, JCMacKenzie, RGMeltzer, LTPugsley, TASmith, SJWise, LD Aryl 1-but-3-ynyl-4-phenyl-1,2,3,6-tetrahydropyridines as potential antipsychotic agents: synthesis and structure-activity relationships. J Med Chem39:3179-87 (1996) 
 
D(4) dopamine receptor
Name:D(4) dopamine receptor
Type:Enzyme
Mol. Mass.:48373.19
Organism:Homo sapiens (Human)
Description:P21917
Residue:419
BDBM50002173
NameBDBM50002173
Synonyms:3-(4-(3,6-dihydro-4-phenyl-1(2H)-pyridinyl)butyl)-1H-indol-5-ol 3-[4-(4-phenyl-3,6-dihydropyridin-1(2H)-yl)butyl]-1H-indol-5-ol roxindole
TypeSmall organic molecule
Emp. Form.C23H26N2O
Mol. Mass.346.4653
SMILESOc1ccc2[nH]cc(CCCCN3CCC(=CC3)c3ccccc3)c2c1