Reaction Details
TargetRetinoic acid receptor alpha
LigandBDBM50052589
Substrate/Competitorn/a
Meas. Tech.ChEMBL_197410 (CHEMBL799799)
Ki 1791±n/a nM
Citation Canan Koch, SSDardashti, LJHebert, JJWhite, SKCroston, GEFlatten, KSHeyman, RANadzan, AM Identification of the first retinoid X, receptor homodimer antagonist. J Med Chem39:3229-34 (1996) 
 
Retinoic acid receptor alpha
Name:Retinoic acid receptor alpha
Type:PROTEIN
Mol. Mass.:50778.87
Organism:Homo sapiens (Human)
Description:ChEMBL_1466191
Residue:462
BDBM50052589
NameBDBM50052589
Synonyms:(2E,4E,6Z)-3-Methyl-7-(5,5,8,8-tetramethyl-3-propoxy-5,6,7,8-tetrahydro-naphthalen-2-yl)-octa-2,4,6-trienoic acid CHEMBL109581
TypeSmall organic molecule
Emp. Form.C26H36O3
Mol. Mass.396.5622
SMILESCCCOc1cc2c(cc1\C(C)=C/C=C/C(/C)=C/C(O)=O)C(C)(C)CCC2(C)C