Reaction Details
TargetRetinoic acid receptor RXR-beta
LigandBDBM50052588
Substrate/Competitorn/a
Meas. Tech.ChEMBL_197058 (CHEMBL804834)
Ki 2±n/a nM
Citation Canan Koch, SSDardashti, LJHebert, JJWhite, SKCroston, GEFlatten, KSHeyman, RANadzan, AM Identification of the first retinoid X, receptor homodimer antagonist. J Med Chem39:3229-34 (1996) 
 
Retinoic acid receptor RXR-beta
Name:Retinoic acid receptor RXR-beta
Type:PROTEIN
Mol. Mass.:56932.89
Organism:Homo sapiens (Human)
Description:ChEMBL_39045
Residue:533
BDBM50052588
NameBDBM50052588
Synonyms:(2E,4E,6Z)-7-(3-Methoxy-5,5,8,8-tetramethyl-5,6,7,8-tetrahydro-naphthalen-2-yl)-3-methyl-octa-2,4,6-trienoic acid | CHEMBL111589
TypeSmall organic molecule
Emp. Form.C24H32O3
Mol. Mass.368.5091
SMILESCOc1cc2c(cc1\C(C)=C/C=C/C(/C)=C/C(O)=O)C(C)(C)CCC2(C)C