Reaction Details
TargetLow-density lipoprotein receptor
LigandBDBM50052678
Substrate/Competitorn/a
Meas. Tech.ChEMBL_99545 (CHEMBL707778)
EC50 1300±n/a nM
Citation Ashton, MJBrown, TJFenton, GHalley, FHarper, MFLockey, PMPorter, BRoach, AGStuttle, KAVicker, NWalsh, RJ New low-density lipoprotein receptor upregulators acting via a novel mechanism. J Med Chem39:3343-56 (1996) 
 
Low-density lipoprotein receptor
Name:Low-density lipoprotein receptor
Type:PROTEIN
Mol. Mass.:95343.42
Organism:Homo sapiens (Human)
Description:ChEMBL_99545
Residue:860
BDBM50052678
NameBDBM50052678
Synonyms:3-Cyclohexyl-N-[4-methyl-3-(5-methyl-1H-benzoimidazol-2-yl)-phenyl]-propionamide | CHEMBL114810
TypeSmall organic molecule
Emp. Form.C24H29N3O
Mol. Mass.375.5066
SMILESCc1ccc2nc([nH]c2c1)-c1cc(NC(=O)CCC2CCCCC2)ccc1C