Reaction Details
TargetLow-density lipoprotein receptor
LigandBDBM50052681
Substrate/Competitorn/a
Meas. Tech.ChEMBL_99545 (CHEMBL707778)
EC50 700±n/a nM
Citation Ashton, MJBrown, TJFenton, GHalley, FHarper, MFLockey, PMPorter, BRoach, AGStuttle, KAVicker, NWalsh, RJ New low-density lipoprotein receptor upregulators acting via a novel mechanism. J Med Chem39:3343-56 (1996) 
 
Low-density lipoprotein receptor
Name:Low-density lipoprotein receptor
Type:PROTEIN
Mol. Mass.:95343.42
Organism:Homo sapiens (Human)
Description:ChEMBL_99545
Residue:860
BDBM50052681
NameBDBM50052681
Synonyms:CHEMBL114890 | N-[3-((Z)-2-Benzo[1,3]dioxol-5-yl-2-cyano-vinyl)-4-methyl-phenyl]-3-cyclohexyl-propionamide
TypeSmall organic molecule
Emp. Form.C26H28N2O3
Mol. Mass.416.5121
SMILESCc1ccc(NC(=O)CCC2CCCCC2)cc1\C=C(/C#N)c1ccc2OCOc2c1