Reaction Details
TargetLow-density lipoprotein receptor
LigandBDBM50052689
Substrate/Competitorn/a
Meas. Tech.ChEMBL_99545 (CHEMBL707778)
EC50 4000±n/a nM
Citation Ashton, MJBrown, TJFenton, GHalley, FHarper, MFLockey, PMPorter, BRoach, AGStuttle, KAVicker, NWalsh, RJ New low-density lipoprotein receptor upregulators acting via a novel mechanism. J Med Chem39:3343-56 (1996) 
 
Low-density lipoprotein receptor
Name:Low-density lipoprotein receptor
Type:PROTEIN
Mol. Mass.:95343.42
Organism:Homo sapiens (Human)
Description:ChEMBL_99545
Residue:860
BDBM50052689
NameBDBM50052689
Synonyms:CHEMBL115205 | N-[5-(4-Cyclohexyl-butyrylamino)-2-methyl-phenyl]-4-hydroxy-benzamide
TypeSmall organic molecule
Emp. Form.C24H30N2O3
Mol. Mass.394.5066
SMILESCc1ccc(NC(=O)CCCC2CCCCC2)cc1NC(=O)c1ccc(O)cc1