Reaction Details
Target5-hydroxytryptamine receptor 1A
LigandBDBM50052858
Substrate/Competitorn/a
Meas. Tech.ChEMBL_1175 (CHEMBL615941)
Ki 17.5±n/a nM
Citation Hedberg, MHJansen, JMNordvall, GHjorth, SUnelius, LJohansson, AM 10-substituted 11-oxygenated (R)-aporphines: synthesis, pharmacology, and modeling of 5-HT1A receptor interactions. J Med Chem39:3491-502 (1996) 
 
5-hydroxytryptamine receptor 1A
Name:5-hydroxytryptamine receptor 1A
Type:G Protein-Coupled Receptor (GPCR)
Mol. Mass.:46445.29
Organism:Rattus norvegicus (rat)
Description:Binding assays were performed using rat hippocampal membranes.
Residue:422
BDBM50052858
NameBDBM50052858
Synonyms:(R)-10-Ethyl-11-methoxy-6-methyl-5,6,6a,7-tetrahydro-4H-dibenzo[de,g]quinoline | CHEMBL331005
TypeSmall organic molecule
Emp. Form.C20H23NO
Mol. Mass.293.4027
SMILESCCc1ccc2C[C@H]3N(C)CCc4cccc(c34)-c2c1OC