Reaction Details
Target5-hydroxytryptamine receptor 1A
LigandBDBM50052864
Substrate/Competitorn/a
Meas. Tech.ChEMBL_1173 (CHEMBL615939)
Ki 4.5±n/a nM
Citation Hedberg, MHLinnanen, TJansen, JMNordvall, GHjorth, SUnelius, LJohansson, AM 11-substituted (R)-aporphines: synthesis, pharmacology, and modeling of D2A and 5-HT1A receptor interactions. J Med Chem39:3503-13 (1996) 
 
5-hydroxytryptamine receptor 1A
Name:5-hydroxytryptamine receptor 1A
Type:G Protein-Coupled Receptor (GPCR)
Mol. Mass.:46445.29
Organism:Rattus norvegicus (rat)
Description:Binding assays were performed using rat hippocampal membranes.
Residue:422
BDBM50052864
NameBDBM50052864
Synonyms:(R)-11-Ethyl-6-methyl-5,6,6a,7-tetrahydro-4H-dibenzo[de,g]quinoline | CHEMBL118254
TypeSmall organic molecule
Emp. Form.C19H21N
Mol. Mass.263.3767
SMILESCCc1cccc2C[C@H]3N(C)CCc4cccc(c34)-c12