Reaction Details
TargetVasopressin V2 receptor
LigandBDBM35714
Substrate/Competitorn/a
Meas. Tech.ChEMBL_215007 (CHEMBL818806)
IC50 12±n/a nM
Citation Ogawa, HYamashita, HKondo, KYamamura, YMiyamoto, HKan, KKitano, KTanaka, MNakaya, KNakamura, SMori, TTominaga, MYabuuchi, Y Orally active, nonpeptide vasopressin V2 receptor antagonists: a novel series of 1-[4-(benzoylamino)benzoyl]-2,3,4,5-tetrahydro-1H-benzazepines and related compounds. J Med Chem39:3547-55 (1996) 
 
Vasopressin V2 receptor
Name:Vasopressin V2 receptor
Type:G-protein coupled receptor
Mol. Mass.:40761.85
Organism:Rattus norvegicus (Rat)
Description:n/a
Residue:371
BDBM35714
NameBDBM35714
Synonyms:CHEMBL420762 N-[4-(5-Dimethylamino-2,3,4,5-tetrahydro-benzo[b]azepine-1-carbonyl)-phenyl]-2-methyl-benzamide | OPC-31260
TypeSmall organic molecule
Emp. Form.C27H29N3O2
Mol. Mass.427.5381
SMILESCN(C)C1CCCN(C(=O)c2ccc(NC(=O)c3ccccc3C)cc2)c2ccccc12