Reaction Details
TargetRetinoic acid receptor beta
LigandBDBM50052959
Substrate/Competitorn/a
Meas. Tech.ChEMBL_195642 (CHEMBL795960)
Kd 10000±n/a nM
Citation Beard, RLColon, DFSong, TKDavies, PJKochhar, DMChandraratna, RA Synthesis and structure-activity relationships of retinoid X receptor selective diaryl sulfide analogs of retinoic acid. J Med Chem39:3556-63 (1996) 
 
Retinoic acid receptor beta
Name:Retinoic acid receptor beta
Type:PROTEIN
Mol. Mass.:53344.93
Organism:Mus musculus
Description:ChEMBL_195641
Residue:482
BDBM50052959
NameBDBM50052959
Synonyms:4-(3,5,5,8,8-Pentamethyl-5,6,7,8-tetrahydro-naphthalene-2-sulfinyl)-benzoic acid | CHEMBL324960
TypeSmall organic molecule
Emp. Form.C22H26O3S
Mol. Mass.370.505
SMILESCc1cc2c(cc1S(=O)c1ccc(cc1)C(O)=O)C(C)(C)CCC2(C)C