Reaction Details
TargetRetinoic acid receptor beta
LigandBDBM50052961
Substrate/Competitorn/a
Meas. Tech.ChEMBL_195642 (CHEMBL795960)
Kd 4239.0±n/a nM
Citation Beard, RLColon, DFSong, TKDavies, PJKochhar, DMChandraratna, RA Synthesis and structure-activity relationships of retinoid X receptor selective diaryl sulfide analogs of retinoic acid. J Med Chem39:3556-63 (1996) 
 
Retinoic acid receptor beta
Name:Retinoic acid receptor beta
Type:PROTEIN
Mol. Mass.:53344.93
Organism:Mus musculus
Description:ChEMBL_195641
Residue:482
BDBM50052961
NameBDBM50052961
Synonyms:4-(5,5,8,8-Tetramethyl-5,6,7,8-tetrahydro-naphthalen-2-ylsulfanyl)-benzoic acid | CHEMBL119781
TypeSmall organic molecule
Emp. Form.C21H24O2S
Mol. Mass.340.479
SMILESCC1(C)CCC(C)(C)c2cc(Sc3ccc(cc3)C(O)=O)ccc12