Reaction Details
TargetRetinoic acid receptor RXR-beta
LigandBDBM50052957
Substrate/Competitorn/a
Meas. Tech.ChEMBL_197068 (CHEMBL806657)
Kd 4122.0±n/a nM
Citation Beard, RLColon, DFSong, TKDavies, PJKochhar, DMChandraratna, RA Synthesis and structure-activity relationships of retinoid X receptor selective diaryl sulfide analogs of retinoic acid. J Med Chem39:3556-63 (1996) 
 
Retinoic acid receptor RXR-beta
Name:Retinoic acid receptor RXR-beta
Type:PROTEIN
Mol. Mass.:55877.78
Organism:Mus musculus
Description:ChEMBL_196588
Residue:520
BDBM50052957
NameBDBM50052957
Synonyms:4-(3,5,5,8,8-Pentamethyl-5,6,7,8-tetrahydro-naphthalene-2-sulfonyl)-benzoic acid | CHEMBL118307
TypeSmall organic molecule
Emp. Form.C22H26O4S
Mol. Mass.386.504
SMILESCc1cc2c(cc1S(=O)(=O)c1ccc(cc1)C(O)=O)C(C)(C)CCC2(C)C