Reaction Details
TargetRetinoic acid receptor gamma
LigandBDBM31883
Substrate/Competitorn/a
Meas. Tech.ChEMBL_196166 (CHEMBL804939)
Kd 18±n/a nM
Citation Beard, RLColon, DFSong, TKDavies, PJKochhar, DMChandraratna, RA Synthesis and structure-activity relationships of retinoid X receptor selective diaryl sulfide analogs of retinoic acid. J Med Chem39:3556-63 (1996) 
 
Retinoic acid receptor gamma
Name:Retinoic acid receptor gamma
Type:PROTEIN
Mol. Mass.:50896.02
Organism:Mus musculus
Description:ChEMBL_196161
Residue:458
BDBM31883
NameBDBM31883
Synonyms:9-cis-retinoic acid (9cRA) AT-RA CHEMBL38 SMR000058245 Vitamin A acid [3H]Retinoic acid [3H]tretinoin cid_444795
Typeradiolabeled ligand
Emp. Form.C20H28O2
Mol. Mass.300.4351
SMILESC\C(\C=C\C1=C(C)CCCC1(C)C)=C/C=C/C(/C)=C/C(O)=O