Reaction Details
TargetRetinoic acid receptor alpha
LigandBDBM31892
Substrate/Competitorn/a
Meas. Tech.ChEMBL_195187 (CHEMBL802720)
Kd 7±n/a nM
Citation Beard, RLColon, DFSong, TKDavies, PJKochhar, DMChandraratna, RA Synthesis and structure-activity relationships of retinoid X receptor selective diaryl sulfide analogs of retinoic acid. J Med Chem39:3556-63 (1996) 
 
Retinoic acid receptor alpha
Name:Retinoic acid receptor alpha
Type:PROTEIN
Mol. Mass.:50742.79
Organism:Mus musculus
Description:ChEMBL_195182
Residue:462
BDBM31892
NameBDBM31892
Synonyms:9-cis retinoic acid CHEMBL705 alitretinoin
TypeSmall organic molecule
Emp. Form.C20H28O2
Mol. Mass.300.4351
SMILESC\C(\C=C\C1=C(C)CCCC1(C)C)=C\C=C\C(\C)=C\C(O)=O