Reaction Details
TargetATP-citrate synthase
LigandBDBM50052985
Substrate/Competitorn/a
Meas. Tech.ChEMBL_29519 (CHEMBL640283)
Ki 6800±n/a nM
Citation Gribble, ADDolle, REShaw, AMcNair, DNovelli, RNovelli, CESlingsby, BPShah, VPTew, DSaxty, BAAllen, MGroot, PHPearce, NYates, J ATP-citrate lyase as a target for hypolipidemic intervention. Design and synthesis of 2-substituted butanedioic acids as novel, potent inhibitors of the enzyme. J Med Chem39:3569-84 (1996) 
 
ATP-citrate synthase
Name:ATP-citrate synthase
Type:PROTEIN
Mol. Mass.:120645.65
Organism:Rattus norvegicus
Description:ChEMBL_857791
Residue:1100
BDBM50052985
NameBDBM50052985
Synonyms:2-[5-(2,4-Dichloro-phenyl)-pentylsulfanylmethyl]-2-hydroxy-succinic acid | CHEMBL334109
TypeSmall organic molecule
Emp. Form.C16H20Cl2O5S
Mol. Mass.395.298
SMILESOC(=O)CC(O)(CSCCCCCc1ccc(Cl)cc1Cl)C(O)=O