Reaction Details
TargetATP-citrate synthase
LigandBDBM50052995
Substrate/Competitorn/a
Meas. Tech.ChEMBL_29518 (CHEMBL640282)
Ki 2900±n/a nM
Citation Gribble, ADDolle, REShaw, AMcNair, DNovelli, RNovelli, CESlingsby, BPShah, VPTew, DSaxty, BAAllen, MGroot, PHPearce, NYates, J ATP-citrate lyase as a target for hypolipidemic intervention. Design and synthesis of 2-substituted butanedioic acids as novel, potent inhibitors of the enzyme. J Med Chem39:3569-84 (1996) 
 
ATP-citrate synthase
Name:ATP-citrate synthase
Type:PROTEIN
Mol. Mass.:120645.65
Organism:Rattus norvegicus
Description:ChEMBL_857791
Residue:1100
BDBM50052995
NameBDBM50052995
Synonyms:2-{2-[5-(2,4-Dichloro-phenyl)-pentylsulfanyl]-ethyl}-2-hydroxy-succinic acid | CHEMBL333756
TypeSmall organic molecule
Emp. Form.C17H22Cl2O5S
Mol. Mass.409.325
SMILESOC(=O)CC(O)(CCSCCCCCc1ccc(Cl)cc1Cl)C(O)=O