Reaction Details
TargetATP-citrate synthase
LigandBDBM50053005
Substrate/Competitorn/a
Meas. Tech.ChEMBL_29518 (CHEMBL640282)
Ki 21000±n/a nM
Citation Gribble, ADDolle, REShaw, AMcNair, DNovelli, RNovelli, CESlingsby, BPShah, VPTew, DSaxty, BAAllen, MGroot, PHPearce, NYates, J ATP-citrate lyase as a target for hypolipidemic intervention. Design and synthesis of 2-substituted butanedioic acids as novel, potent inhibitors of the enzyme. J Med Chem39:3569-84 (1996) 
 
ATP-citrate synthase
Name:ATP-citrate synthase
Type:PROTEIN
Mol. Mass.:120645.65
Organism:Rattus norvegicus
Description:ChEMBL_857791
Residue:1100
BDBM50053005
NameBDBM50053005
Synonyms:2-(5-Biphenyl-2-yl-pentylsulfanylmethyl)-2-hydroxy-succinic acid | CHEMBL118961
TypeSmall organic molecule
Emp. Form.C22H26O5S
Mol. Mass.402.504
SMILESOC(=O)CC(O)(CSCCCCCc1ccccc1-c1ccccc1)C(O)=O