Reaction Details
TargetATP-citrate synthase
LigandBDBM50053011
Substrate/Competitorn/a
Meas. Tech.ChEMBL_29518 (CHEMBL640282)
Ki 25000±n/a nM
Citation Gribble, ADDolle, REShaw, AMcNair, DNovelli, RNovelli, CESlingsby, BPShah, VPTew, DSaxty, BAAllen, MGroot, PHPearce, NYates, J ATP-citrate lyase as a target for hypolipidemic intervention. Design and synthesis of 2-substituted butanedioic acids as novel, potent inhibitors of the enzyme. J Med Chem39:3569-84 (1996) 
 
ATP-citrate synthase
Name:ATP-citrate synthase
Type:PROTEIN
Mol. Mass.:120645.65
Organism:Rattus norvegicus
Description:ChEMBL_857791
Residue:1100
BDBM50053011
NameBDBM50053011
Synonyms:4-[6-(2,4-Dichloro-phenyl)-hexylsulfanyl]-butyric acid | CHEMBL120795
TypeSmall organic molecule
Emp. Form.C16H22Cl2O2S
Mol. Mass.349.316
SMILESOC(=O)CCCSCCCCCCc1ccc(Cl)cc1Cl