Reaction Details
TargetATP-citrate synthase
LigandBDBM50053014
Substrate/Competitorn/a
Meas. Tech.ChEMBL_29518 (CHEMBL640282)
Ki 38000±n/a nM
Citation Gribble, ADDolle, REShaw, AMcNair, DNovelli, RNovelli, CESlingsby, BPShah, VPTew, DSaxty, BAAllen, MGroot, PHPearce, NYates, J ATP-citrate lyase as a target for hypolipidemic intervention. Design and synthesis of 2-substituted butanedioic acids as novel, potent inhibitors of the enzyme. J Med Chem39:3569-84 (1996) 
 
ATP-citrate synthase
Name:ATP-citrate synthase
Type:PROTEIN
Mol. Mass.:120645.65
Organism:Rattus norvegicus
Description:ChEMBL_857791
Residue:1100
BDBM50053014
NameBDBM50053014
Synonyms:2-(6-Biphenyl-4-yl-hexylsulfanylmethyl)-2-hydroxy-succinic acid | CHEMBL333104
TypeSmall organic molecule
Emp. Form.C23H28O5S
Mol. Mass.416.53
SMILESOC(=O)CC(O)(CSCCCCCCc1ccc(cc1)-c1ccccc1)C(O)=O