Reaction Details
TargetATP-citrate synthase
LigandBDBM50053016
Substrate/Competitorn/a
Meas. Tech.ChEMBL_29518 (CHEMBL640282)
Ki 7400±n/a nM
Citation Gribble, ADDolle, REShaw, AMcNair, DNovelli, RNovelli, CESlingsby, BPShah, VPTew, DSaxty, BAAllen, MGroot, PHPearce, NYates, J ATP-citrate lyase as a target for hypolipidemic intervention. Design and synthesis of 2-substituted butanedioic acids as novel, potent inhibitors of the enzyme. J Med Chem39:3569-84 (1996) 
 
ATP-citrate synthase
Name:ATP-citrate synthase
Type:PROTEIN
Mol. Mass.:120645.65
Organism:Rattus norvegicus
Description:ChEMBL_857791
Residue:1100
BDBM50053016
NameBDBM50053016
Synonyms:2-[(E)-6-(2,4-Dichloro-phenyl)-hex-5-enylsulfanylmethyl]-2-hydroxy-succinic acid | CHEMBL118149
TypeSmall organic molecule
Emp. Form.C17H20Cl2O5S
Mol. Mass.407.309
SMILESOC(=O)CC(O)(CSCCCC\C=C\c1ccc(Cl)cc1Cl)C(O)=O