Reaction Details
TargetATP-citrate synthase
LigandBDBM50053022
Substrate/Competitorn/a
Meas. Tech.ChEMBL_29519 (CHEMBL640283)
Ki 94000±n/a nM
Citation Gribble, ADDolle, REShaw, AMcNair, DNovelli, RNovelli, CESlingsby, BPShah, VPTew, DSaxty, BAAllen, MGroot, PHPearce, NYates, J ATP-citrate lyase as a target for hypolipidemic intervention. Design and synthesis of 2-substituted butanedioic acids as novel, potent inhibitors of the enzyme. J Med Chem39:3569-84 (1996) 
 
ATP-citrate synthase
Name:ATP-citrate synthase
Type:PROTEIN
Mol. Mass.:120645.65
Organism:Rattus norvegicus
Description:ChEMBL_857791
Residue:1100
BDBM50053022
NameBDBM50053022
Synonyms:2-[6-(2-Benzyl-phenyl)-hexylsulfanylmethyl]-2-hydroxy-succinic acid | CHEMBL120407
TypeSmall organic molecule
Emp. Form.C24H30O5S
Mol. Mass.430.557
SMILESOC(=O)CC(O)(CSCCCCCCc1ccccc1Cc1ccccc1)C(O)=O