Reaction Details
TargetRetinoic acid receptor alpha
LigandBDBM50035477
Substrate/Competitorn/a
Meas. Tech.ChEMBL_195184 (CHEMBL801817)
IC50 8±n/a nM
Citation Muccio, DDBrouillette, WJAlam, MVaezi, MFSani, BPVenepally, PReddy, LLi, ENorris, AWSimpson-Herren, LHill, DL Conformationally defined 6-s-trans-retinoic acid analogs. 3. Structure-activity relationships for nuclear receptor binding, transcriptional activity, and cancer chemopreventive activity. J Med Chem39:3625-35 (1996) 
 
Retinoic acid receptor alpha
Name:Retinoic acid receptor alpha
Type:PROTEIN
Mol. Mass.:50742.79
Organism:Mus musculus
Description:ChEMBL_195182
Residue:462
BDBM50035477
NameBDBM50035477
Synonyms:(2E,4E,6E)-8-[2-Isopropyl-3-methyl-cyclohex-2-en-(E)-ylidene]-3,7-dimethyl-octa-2,4,6-trienoic acid | CHEMBL333032
TypeSmall organic molecule
Emp. Form.C20H28O2
Mol. Mass.300.4351
SMILESCC(C)C1=C(C)CCC\C1=C/C(/C)=C/C=C/C(/C)=C/C(O)=O