Reaction Details
TargetRetinoic acid receptor RXR-alpha
LigandBDBM50053094
Substrate/Competitorn/a
Meas. Tech.ChEMBL_196617 (CHEMBL800653)
Kd>200±n/a nM
Citation Muccio, DDBrouillette, WJAlam, MVaezi, MFSani, BPVenepally, PReddy, LLi, ENorris, AWSimpson-Herren, LHill, DL Conformationally defined 6-s-trans-retinoic acid analogs. 3. Structure-activity relationships for nuclear receptor binding, transcriptional activity, and cancer chemopreventive activity. J Med Chem39:3625-35 (1996) 
 
Retinoic acid receptor RXR-alpha
Name:Retinoic acid receptor RXR-alpha
Type:PROTEIN
Mol. Mass.:50820.38
Organism:Homo sapiens (Human)
Description:ChEMBL_1456363
Residue:462
BDBM50053094
NameBDBM50053094
Synonyms:(2E,4E,6E)-8-[2,3-Dimethyl-cyclohex-2-en-(E)-ylidene]-3,7-dimethyl-octa-2,4,6-trienoic acid | CHEMBL122823
TypeSmall organic molecule
Emp. Form.C18H24O2
Mol. Mass.272.382
SMILESC\C(\C=C\C=C(/C)\C=C1/CCCC(C)=C1C)=C/C(O)=O