Reaction Details
TargetCellular retinoic acid-binding protein 1
LigandBDBM50407270
Substrate/Competitorn/a
Meas. Tech.ChEMBL_52266 (CHEMBL665219)
IC50>10000±n/a nM
Citation Muccio, DDBrouillette, WJAlam, MVaezi, MFSani, BPVenepally, PReddy, LLi, ENorris, AWSimpson-Herren, LHill, DL Conformationally defined 6-s-trans-retinoic acid analogs. 3. Structure-activity relationships for nuclear receptor binding, transcriptional activity, and cancer chemopreventive activity. J Med Chem39:3625-35 (1996) 
 
Cellular retinoic acid-binding protein 1
Name:Cellular retinoic acid-binding protein 1
Type:PROTEIN
Mol. Mass.:15660.02
Organism:Gallus gallus
Description:ChEMBL_52265
Residue:137
BDBM50407270
NameBDBM50407270
Synonyms:CHEMBL2111790
TypeSmall organic molecule
Emp. Form.C20H28O2
Mol. Mass.300.4351
SMILESCC(C)C1=C(C)CCC\C1=C/C(/C)=C\C=C\C(\C)=C\C(O)=O