Reaction Details
TargetPhospholipase A2
LigandBDBM50053133
Substrate/Competitorn/a
Meas. Tech.ChEMBL_156184 (CHEMBL760953)
IC50 5±n/a nM
Citation Hagishita, SYamada, MShirahase, KOkada, TMurakami, YIto, YMatsuura, TWada, MKato, TUeno, MChikazawa, YYamada, KOno, TTeshirogi, IOhtani, M Potent inhibitors of secretory phospholipase A2: synthesis and inhibitory activities of indolizine and indene derivatives. J Med Chem39:3636-58 (1996) 
 
Phospholipase A2
Name:Phospholipase A2
Type:Protein
Mol. Mass.:16364.13
Organism:Homo sapiens (Human)
Description:P04054
Residue:148
BDBM50053133
NameBDBM50053133
Synonyms:(1-Aminooxalyl-3-benzyl-2-ethyl-indolizin-8-yloxy)-acetic acid | CHEMBL121617
TypeSmall organic molecule
Emp. Form.C21H20N2O5
Mol. Mass.380.3939
SMILESCCc1c(Cc2ccccc2)n2cccc(OCC(O)=O)c2c1C(=O)C(N)=O