Reaction Details
TargetHistamine H3 receptor
LigandBDBM50053275
Substrate/Competitorn/a
Meas. Tech.ChEMBL_86909 (CHEMBL698419)
Ki 5.1±n/a nM
Citation Ganellin, CRFkyerat, ABang-Andersen, BAthmani, STertiuk, WGarbarg, MLigneau, XSchwartz, JC A novel series of (phenoxyalkyl)imidazoles as potent H3-receptor histamine antagonists. J Med Chem39:3806-13 (1996) 
 
Histamine H3 receptor
Name:Histamine H3 receptor
Type:G Protein-Coupled Receptor (GPCR)
Mol. Mass.:48607.98
Organism:Rattus norvegicus (rat)
Description:n/a
Residue:445
BDBM50053275
NameBDBM50053275
Synonyms:4-[2-(1H-Imidazol-4-yl)-ethoxy]-benzoic acid methyl ester | CHEMBL127404
TypeSmall organic molecule
Emp. Form.C13H14N2O3
Mol. Mass.246.2619
SMILESCOC(=O)c1ccc(OCCc2cnc[nH]2)cc1