Reaction Details
TargetLeukotriene B4 receptor 1
LigandBDBM50052027
Substrate/Competitorn/a
Meas. Tech.ChEMBL_99651 (CHEMBL709309)
IC50 16800±n/a nM
Citation Daines, RAChambers, PAFoley, JJGriswold, DEKingsbury, WDMartin, LDSchmidt, DBSham, KKSarau, HM (E)-3-[6-[[(2,6-dichlorophenyl)thio]methyl]-3-(2-phenylethoxy)-2- pyridinyl]-2-propenoic acid: a high-affinity leukotriene B4 receptor antagonist with oral antiinflammatory activity. J Med Chem39:3837-41 (1996) 
 
Leukotriene B4 receptor 1
Name:Leukotriene B4 receptor 1
Type:Enzyme Catalytic Domain
Mol. Mass.:37582.68
Organism:Homo sapiens (Human)
Description:Q15722
Residue:352
BDBM50052027
NameBDBM50052027
Synonyms:(E)-3-[6-(2,6-Dichloro-phenylsulfanylmethyl)-3-phenethyloxy-pyridin-2-yl]-acrylic acid SB-209247 | Ticolubant
TypeSmall organic molecule
Emp. Form.C23H19Cl2NO3S
Mol. Mass.460.373
SMILESOC(=O)\C=C\c1nc(CSc2c(Cl)cccc2Cl)ccc1OCCc1ccccc1