Reaction Details
TargetCannabinoid receptor 1
LigandBDBM50454329
Substrate/Competitorn/a
Meas. Tech.ChEMBL_46633 (CHEMBL658889)
Ki 1.2±n/a nM
Citation Huffman, JWYu, SShowalter, VAbood, MEWiley, JLCompton, DRMartin, BRBramblett, RDReggio, PH Synthesis and pharmacology of a very potent cannabinoid lacking a phenolic hydroxyl with high affinity for the CB2 receptor. J Med Chem39:3875-7 (1996) 
 
Cannabinoid receptor 1
Name:Cannabinoid receptor 1
Type:G Protein-Coupled Receptor (GPCR)
Mol. Mass.:52856.55
Organism:Rattus norvegicus (rat)
Description:P20272
Residue:473
BDBM50454329
NameBDBM50454329
Synonyms:CHEMBL2112647
TypeSmall organic molecule
Emp. Form.C25H38O2
Mol. Mass.370.568
SMILES[H][C@@]12CC(CO)=CC[C@@]1([H])C(C)(C)Oc1cc(CCCCCC(C)(C)C)ccc21