Reaction Details
Target5-hydroxytryptamine receptor 3A/3B/3C/3D/3E
LigandBDBM50053609
Substrate/Competitorn/a
Meas. Tech.ChEMBL_3444 (CHEMBL618129)
Ki 780±n/a nM
Citation Dukat, MAbdel-Rahman, AAIsmaiel, AMIngher, STeitler, MGyermek, LGlennon, RA Structure-activity relationships for the binding of arylpiperazines and arylbiguanides at 5-HT3 serotonin receptors. J Med Chem39:4017-26 (1996) 
 
5-hydroxytryptamine receptor 3A/3B/3C/3D/3E
Name:5-hydroxytryptamine receptor 3A/3B/3C/3D/3E
Type:n/a
Mol. Mass.:n/a
Description:ASSAY_ID of EBI is 3422
Components:This complex has 5 components.
Component 1
Name:5-hydroxytryptamine receptor 3A
Synonyms:5-HT-3 5-HT3A 5-hydroxytryptamine receptor 3 (5-HT3) 5-hydroxytryptamine receptor 3A (5HT3A) 5HT3R HTR3A Serotonin 3 receptor (5HT3) Serotonin-gated ion channel receptor | Serotonin-gated ion channel receptor 3
Type:Protein
Mol. Mass.:55283.27
Organism:Homo sapiens (Human)
Description:P46098
Residue:478
Component 2
Name:5-hydroxytryptamine receptor 3B
Synonyms:5-HT-3B 5-hydroxytryptamine receptor 3B HTR3B Serotonin receptor 3B
Type:PROTEIN
Mol. Mass.:50281.60
Organism:Homo sapiens (Human)
Description:EBI_11305
Residue:441
Component 3
Name:5-hydroxytryptamine receptor 3C
Synonyms:5HT3C_HUMAN Serotonin (5-HT3) receptor
Type:PROTEIN
Mol. Mass.:50216.00
Organism:Homo sapiens (Human)
Description:EBI_12117
Residue:447
Component 4
Name:5-hydroxytryptamine receptor 3D
Synonyms:5HT3D_HUMAN Serotonin (5-HT3) receptor
Type:PROTEIN
Mol. Mass.:50209.16
Organism:Homo sapiens (Human)
Description:EBI_12960
Residue:454
Component 5
Name:5-hydroxytryptamine receptor 3E
Synonyms:5HT3E_HUMAN Serotonin (5-HT3) receptor
Type:PROTEIN
Mol. Mass.:51440.34
Organism:Homo sapiens (Human)
Description:EBI_14002
Residue:456
BDBM50053609
NameBDBM50053609
Synonyms:2-Methyl-Phenyl biguanide N-(3-methylphenyl)imidodicarbonimidic diamide
TypeSmall organic molecule
Emp. Form.C9H13N5
Mol. Mass.191.233
SMILESCc1cccc(NC(N)=NC(N)=N)c1