Reaction Details
TargetCalpain-2 catalytic subunit
LigandBDBM50053829
Substrate/Competitorn/a
Meas. Tech.ChEMBL_43853 (CHEMBL658514)
Ki 50.0±n/a nM
Citation Li, ZOrtega-Vilain, ACPatil, GSChu, DLForeman, JEEveleth, DDPowers, JC Novel peptidyl alpha-keto amide inhibitors of calpains and other cysteine proteases. J Med Chem39:4089-98 (1996) 
 
Calpain-2 catalytic subunit
Name:Calpain-2 catalytic subunit
Type:Protein
Mol. Mass.:79965.18
Organism:Homo sapiens (Human)
Description:n/a
Residue:700
BDBM50053829
NameBDBM50053829
Synonyms:CHEMBL134179 | {1-[1-Benzyl-2-(2-hydroxy-2-phenyl-ethylcarbamoyl)-2-oxo-ethylcarbamoyl]-3-methyl-butyl}-carbamic acid benzyl ester
TypeSmall organic molecule
Emp. Form.C32H37N3O6
Mol. Mass.559.6527
SMILESCC(C)CC(NC(=O)OCc1ccccc1)C(=O)NC(Cc1ccccc1)C(=O)C(=O)NCC(O)c1ccccc1