Reaction Details
TargetCalpain-2 catalytic subunit
LigandBDBM50053791
Substrate/Competitorn/a
Meas. Tech.ChEMBL_43853 (CHEMBL658514)
Ki 160±n/a nM
Citation Li, ZOrtega-Vilain, ACPatil, GSChu, DLForeman, JEEveleth, DDPowers, JC Novel peptidyl alpha-keto amide inhibitors of calpains and other cysteine proteases. J Med Chem39:4089-98 (1996) 
 
Calpain-2 catalytic subunit
Name:Calpain-2 catalytic subunit
Type:Protein
Mol. Mass.:79965.18
Organism:Homo sapiens (Human)
Description:n/a
Residue:700
BDBM50053791
NameBDBM50053791
Synonyms:CHEMBL132566 | [1-(1-Benzyl-2-oxo-2-{2-[5-((3aR,6S,6aS)-2-oxo-hexahydro-thieno[3,4-d]imidazol-6-yl)-pentanoylamino]-ethylcarbamoyl}-ethylcarbamoyl)-3-methyl-butyl]-carbamic acid benzyl ester
TypeSmall organic molecule
Emp. Form.C36H48N6O7S
Mol. Mass.708.867
SMILESCC(C)CC(NC(=O)OCc1ccccc1)C(=O)NC(Cc1ccccc1)C(=O)C(=O)NCCNC(=O)CCCC[C@@H]1SC[C@@H]2NC(=O)N[C@H]12