Reaction Details
TargetCalpain-2 catalytic subunit
LigandBDBM50053827
Substrate/Competitorn/a
Meas. Tech.ChEMBL_43853 (CHEMBL658514)
Ki 250±n/a nM
Citation Li, ZOrtega-Vilain, ACPatil, GSChu, DLForeman, JEEveleth, DDPowers, JC Novel peptidyl alpha-keto amide inhibitors of calpains and other cysteine proteases. J Med Chem39:4089-98 (1996) 
 
Calpain-2 catalytic subunit
Name:Calpain-2 catalytic subunit
Type:Protein
Mol. Mass.:79965.18
Organism:Homo sapiens (Human)
Description:n/a
Residue:700
BDBM50053827
NameBDBM50053827
Synonyms:3-[4-Methyl-2-(2-naphthalen-1-yl-acetylamino)-pentanoylamino]-2-oxo-pentanoic acid ethylamide | CHEMBL130215
TypeSmall organic molecule
Emp. Form.C25H33N3O4
Mol. Mass.439.5472
SMILESCCNC(=O)C(=O)C(CC)NC(=O)C(CC(C)C)NC(=O)Cc1cccc2ccccc12