Reaction Details
TargetCalpain-2 catalytic subunit
LigandBDBM50053823
Substrate/Competitorn/a
Meas. Tech.ChEMBL_43853 (CHEMBL658514)
Ki 110±n/a nM
Citation Li, ZOrtega-Vilain, ACPatil, GSChu, DLForeman, JEEveleth, DDPowers, JC Novel peptidyl alpha-keto amide inhibitors of calpains and other cysteine proteases. J Med Chem39:4089-98 (1996) 
 
Calpain-2 catalytic subunit
Name:Calpain-2 catalytic subunit
Type:Protein
Mol. Mass.:79965.18
Organism:Homo sapiens (Human)
Description:n/a
Residue:700
BDBM50053823
NameBDBM50053823
Synonyms:CHEMBL130580 | Isoquinoline-1-carboxylic acid [1-(1-ethylaminooxalyl-propylcarbamoyl)-3-methyl-butyl]-amide
TypeSmall organic molecule
Emp. Form.C23H30N4O4
Mol. Mass.426.5087
SMILESCCNC(=O)C(=O)C(CC)NC(=O)C(CC(C)C)NC(=O)c1nccc2ccccc12