Reaction Details
TargetCalpain-2 catalytic subunit
LigandBDBM50053826
Substrate/Competitorn/a
Meas. Tech.ChEMBL_43853 (CHEMBL658514)
Ki 290±n/a nM
Citation Li, ZOrtega-Vilain, ACPatil, GSChu, DLForeman, JEEveleth, DDPowers, JC Novel peptidyl alpha-keto amide inhibitors of calpains and other cysteine proteases. J Med Chem39:4089-98 (1996) 
 
Calpain-2 catalytic subunit
Name:Calpain-2 catalytic subunit
Type:Protein
Mol. Mass.:79965.18
Organism:Homo sapiens (Human)
Description:n/a
Residue:700
BDBM50053826
NameBDBM50053826
Synonyms:(1-{1-Benzyl-2-[2-hydroxy-2-(3-trifluoromethyl-phenyl)-ethylcarbamoyl]-2-oxo-ethylcarbamoyl}-3-methyl-butyl)-carbamic acid benzyl ester | CHEMBL435203
TypeSmall organic molecule
Emp. Form.C33H36F3N3O6
Mol. Mass.627.6506
SMILESCC(C)CC(NC(=O)OCc1ccccc1)C(=O)NC(Cc1ccccc1)C(=O)C(=O)NCC(O)c1cccc(c1)C(F)(F)F