Reaction Details
TargetCalpain-2 catalytic subunit
LigandBDBM50042414
Substrate/Competitorn/a
Meas. Tech.ChEMBL_43853 (CHEMBL658514)
Ki 43.0±n/a nM
Citation Li, ZOrtega-Vilain, ACPatil, GSChu, DLForeman, JEEveleth, DDPowers, JC Novel peptidyl alpha-keto amide inhibitors of calpains and other cysteine proteases. J Med Chem39:4089-98 (1996) 
 
Calpain-2 catalytic subunit
Name:Calpain-2 catalytic subunit
Type:Protein
Mol. Mass.:79965.18
Organism:Homo sapiens (Human)
Description:n/a
Residue:700
BDBM50042414
NameBDBM50042414
Synonyms:CHEMBL119622 | {3-Methyl-1-[1-(3-phenyl-propylaminooxalyl)-propylcarbamoyl]-butyl}-carbamic acid benzyl ester
TypeSmall organic molecule
Emp. Form.C28H37N3O5
Mol. Mass.495.6105
SMILESCCC(NC(=O)C(CC(C)C)NC(=O)OCc1ccccc1)C(=O)C(=O)NCCCc1ccccc1